{"text_format":"1","workbook":"xlsx","n_sheets":15,"sheets":["README","Tapestry (autodraw)","Tapestry (U-fill)","Harrow Spell (autodraw)","Harrow Spell (U-fill)","Bridge (autodraw)","Bridge (U-fill)","Cross (autodraw)","Cross (U-fill)","Sword (autodraw)","Sword (U-fill)","Path (autodraw)","Cards","Data","Draw"],"not_rendered":{"charts":0,"images":0,"macros":1,"external_links":0,"defined_names":19,"comments":0,"pivot_tables":0},"unopened":[],"bounds":{"document_bytes":16777216,"sheet_cells":100000,"rows_first":2000,"rows_last":500,"rows_between":2000,"halvings":0,"cell_chars":16384,"cell_head_chars":4096},"cells_cut":0,"cells_raw":0,"read":"whole","date_system":"1900"}

{"sheet":"README","index":0,"n_rows":17,"n_cols":3,"rows_kept":17,"cut":false,"hidden":false,"merged":[[9,1,9,5],[11,1,11,5],[12,1,12,5],[14,1,14,5],[1,1,1,5],[3,2,3,5],[5,2,5,5],[7,1,7,5]]}
[]
[null,"This spreadsheet is designed as aid for those using the Harrow Deck in their Pathfinder® games. It functions in one of two modes, depending on which tab of the spreadsheet you select:"]
[]
[null,null,"Autodraw. Automatically deal cards into the chosen spread and print the interpretations of each, along with automatic indication of misaligned cards, and for the traditional Harrow reading (The Tapestry), highlighting of True Matches, Partial Matches, and Opposed Matches. This is useful for GM's or players who want a quick reading with no fuss."]
[]
[null,null,"U-fill. You enter the card names into the slots of the chosen spread in order to obtain the card interpretations per #1. This mode provides a quick and easy interpretation reference for a reading made from a physical deck, eliminating the need to flip back and forth between pages in the Harrow Deck rule book."]
{"$rows_left_out":12}
{"sheet":"Tapestry (autodraw)","index":1,"n_rows":15,"n_cols":17,"rows_kept":15,"cut":false,"hidden":false,"merged":[[3,10,3,12],[2,10,2,12],[7,6,7,8],[6,5,9,5],[4,10,4,12],[4,6,4,8],[9,10,9,12],[4,1,4,3],[2,1,2,3],[1,1,1,2],[3,1,3,3],[9,14,9,16],[7,14,7,16],[2,14,2,16],[3,14,3,16],[4,14,4,16],[8,14,8,16],[1,5,4,5],[2,6,2,8],[8,6,8,8],[8,10,8,12],[3,6,3,8],[7,10,7,12],[0,10,0,12],[0,6,0,8],[0,1,0,3],[0,14,0,16],[14,6,14,8],[13,6,13,8],[12,10,12,12],[13,10,13,12],[13,14,13,16],[14,14,14,16],[9,6,9,8],[12,14,12,16],[11,5,14,5],[12,6,12,8],[14,10,14,12],[6,1,11,3]]}
[null,"Choosing",null,null,null,null,"Past",null,null,null,"Present",null,null,null,"Future"]
[null,null,null,{"$f":"IFERROR(IF(ISBLANK(B2),\"\",VLOOKUP(B3,Cards,4,FALSE)),\"\")","v":""},null,"Positive",{"$f":"IFERROR(LEFT(VLOOKUP(G3,Cards!$B$2:$G$55,3,FALSE),3),\"\")","v":""},null,{"$f":"IFERROR(VLOOKUP(G3,Cards,4,FALSE),\"\")","v":""},null,{"$f":"IFERROR(LEFT(VLOOKUP(K3,Cards!$B$2:$G$55,3,FALSE),3),\"\")","v":""},null,{"$f":"IFERROR(VLOOKUP(K3,Cards,4,FALSE),\"\")","v":""},null,{"$f":"IFERROR(LEFT(VLOOKUP(O3,Cards!$B$2:$G$55,3,FALSE),3),\"\")","v":""},null,{"$f":"IFERROR(VLOOKUP(O3,Cards,4,FALSE),\"\")","v":""}]
[null,{"$f":"IFERROR(VLOOKUP(B2&\"-\"&RANDBETWEEN(1,9),cardattrindex,2),\"\")","v":""},null,null,null,null,{"$f":"IF(ISBLANK($B$2),\"\",Draw!K2)","v":""},null,null,null,{"$f":"IF(ISBLANK($B$2),\"\",Draw!K3)","v":""},null,null,null,{"$f":"IF(ISBLANK($B$2),\"\",Draw!K4)","v":""}]
[null,{"$f":"IFERROR(VLOOKUP(B3,Cards,5,FALSE),\"\")","v":""},null,null,null,null,{"$f":"IFERROR(VLOOKUP(G3,Cards,5,FALSE),\"\")","v":""},null,null,null,{"$f":"IFERROR(VLOOKUP(K3,Cards,5,FALSE),\"\")","v":""},null,null,null,{"$f":"IFERROR(VLOOKUP(O3,Cards,5,FALSE),\"\")","v":""}]
[null,null,null,null,null,null,{"$f":"IFERROR(IF(RIGHT(I2,1)=\"E\",VLOOKUP(G3,Cards,6,FALSE),\"\"),\"\")","v":""},null,null,null,{"$f":"IFERROR(IF(RIGHT(M2,1)=\"E\",VLOOKUP(K3,Cards,6,FALSE),\"\"),\"\")","v":""},null,null,null,{"$f":"IFERROR(IF(RIGHT(Q2,1)=\"E\",VLOOKUP(O3,Cards,6,FALSE),\"\"),\"\")","v":""}]
[]
{"$rows_left_out":10}
{"sheet":"Tapestry (U-fill)","index":2,"n_rows":15,"n_cols":17,"rows_kept":15,"cut":false,"hidden":false,"merged":[[5,1,5,3],[6,1,6,2],[7,1,7,3],[8,1,8,3],[9,1,9,3],[1,1,3,3],[8,14,8,16],[9,14,9,16],[7,14,7,16],[14,14,14,16],[13,6,13,8],[14,6,14,8],[12,6,12,8],[13,14,13,16],[12,14,12,16],[0,10,0,12],[0,6,0,8],[0,14,0,16],[14,10,14,12],[13,10,13,12],[3,14,3,16],[2,14,2,16],[3,10,3,12],[2,10,2,12],[3,6,3,8],[2,6,2,8],[8,6,8,8],[9,6,9,8],[7,10,7,12],[4,10,4,12],[4,14,4,16],[1,5,4,5],[6,5,9,5],[12,10,12,12],[7,6,7,8],[4,6,4,8],[8,10,8,12],[9,10,9,12],[11,5,14,5]]}
[null,null,null,null,null,null,"Past",null,null,null,"Present",null,null,null,"Future"]
[null,"Instructions\n\nEnter each card in the tapestry by selecting it via the gray drop-down box. True matches are highlighted in blue, partial matches in yellow, and opposed matches in red. If a card has a misaligned placement, the misaligned meaning is displayed in the lower box.\n\nNote that the spreadsheet does not try to detect if a card is in the spread in two places.",null,null,null,"Positive",{"$f":"IFERROR(LEFT(VLOOKUP(G3,Cards,3,FALSE),3),\"\")","v":""},null,{"$f":"IFERROR(VLOOKUP(G3,Cards,4,FALSE),\"\")","v":""},null,{"$f":"IFERROR(LEFT(VLOOKUP(K3,Cards,3,FALSE),3),\"\")","v":""},null,{"$f":"IFERROR(VLOOKUP(K3,Cards,4,FALSE),\"\")","v":""},null,{"$f":"IFERROR(LEFT(VLOOKUP(O3,Cards,3,FALSE),3),\"\")","v":""},null,{"$f":"IFERROR(VLOOKUP(O3,Cards,4,FALSE),\"\")","v":""}]
[]
[null,null,null,null,null,null,{"$f":"IFERROR(VLOOKUP(G3,Cards,5,FALSE),\"\")","v":""},null,null,null,{"$f":"IFERROR(VLOOKUP(K3,Cards,5,FALSE),\"\")","v":""},null,null,null,{"$f":"IFERROR(VLOOKUP(O3,Cards,5,FALSE),\"\")","v":""}]
[null,null,null,null,null,null,{"$f":"IFERROR(IF(RIGHT(I2,1)=\"E\",VLOOKUP(G3,Cards,6,FALSE),\"\"),\"\")","v":""},null,null,null,{"$f":"IFERROR(IF(RIGHT(M2,1)=\"E\",VLOOKUP(K3,Cards,6,FALSE),\"\"),\"\")","v":""},null,null,null,{"$f":"IFERROR(IF(RIGHT(Q2,1)=\"E\",VLOOKUP(O3,Cards,6,FALSE),\"\"),\"\")","v":""}]
[null,"Choosing (Optional)"]
{"$rows_left_out":10}
{"sheet":"Harrow Spell (autodraw)","index":3,"n_rows":22,"n_cols":17,"rows_kept":22,"cut":false,"hidden":false,"merged":[[20,10,20,12],[9,15,9,16],[10,1,10,3],[1,1,1,3],[9,1,9,3],[7,6,8,8],[7,10,8,12],[3,1,3,3],[4,1,4,3],[3,6,6,8],[3,10,6,12],[9,7,9,8],[9,11,9,12],[12,1,12,3],[13,1,13,3],[14,1,14,3],[11,1,11,2],[15,1,15,3],[11,5,14,5],[12,6,12,8],[12,10,12,12],[12,14,12,16],[13,6,13,8],[13,10,13,12],[13,14,13,16],[14,6,14,8],[14,10,14,12],[14,14,14,16],[0,1,0,3],[0,6,0,8],[0,10,0,12],[0,14,0,16],[1,5,8,5],[2,6,2,8],[2,10,2,12],[2,14,2,16],[3,14,6,16],[7,14,8,16],[6,1,8,3],[16,1,21,3],[15,7,15,8],[15,11,15,12],[15,15,15,16],[21,7,21,8],[21,11,21,12],[21,15,21,16],[20,14,20,16],[17,5,20,5],[18,6,18,8],[18,10,18,12],[18,14,18,16],[19,6,19,8],[19,10,19,12],[19,14,19,16],[20,6,20,8]]}
[null,"Alignment",null,null,null,null,"Past",null,null,null,"Present",null,null,null,"Future"]
[null,null,null,null,null,"Positive",{"$f":"IFERROR(LEFT(VLOOKUP(G3,Cards!$B$2:$G$55,3,FALSE),3),\"\")","v":""},null,{"$f":"IFERROR(VLOOKUP(G3,Cards,4,FALSE),\"\")","v":""},null,{"$f":"IFERROR(LEFT(VLOOKUP(K3,Cards!$B$2:$G$55,3,FALSE),3),\"\")","v":""},null,{"$f":"IFERROR(VLOOKUP(K3,Cards,4,FALSE),\"\")","v":""},null,{"$f":"IFERROR(LEFT(VLOOKUP(O3,Cards!$B$2:$G$55,3,FALSE),3),\"\")","v":""},null,{"$f":"IFERROR(VLOOKUP(O3,Cards,4,FALSE),\"\")","v":""}]
[null,null,{"$f":"IF(B2=\"N\",\"<-- Choose one of CE,LE,CG,LG\",\"\")","v":""},null,null,null,{"$f":"IF(LEN(opposite)=0,\"\",Draw!K2)","v":""},null,null,null,{"$f":"IF(LEN(opposite)=0,\"\",Draw!K3)","v":""},null,null,null,{"$f":"IF(LEN(opposite)=0,\"\",Draw!K4)","v":""}]
[null,{"$f":"IF(alignment=\"\",\"\",IF(alignment=\"N\",IF(LEN(override)=2,override,\"\"),IF(LEFT(alignment,1)=\"L\",\"C\",IF(LEFT(alignment,1)=\"C\",\"L\",\"N\"))&IF(RIGHT(alignment,1)=\"G\",\"E\",IF(RIGHT(alignment,1)=\"E\",\"G\",\"N\"))))","v":""},null,null,null,null,{"$f":"IFERROR(VLOOKUP(G3,Cards,5,FALSE),\"\")","v":""},null,null,null,{"$f":"IFERROR(VLOOKUP(K3,Cards,5,FALSE),\"\")","v":""},null,null,null,{"$f":"IFERROR(VLOOKUP(O3,Cards,5,FALSE),\"\")","v":""}]
[null,"Opposite"]
[]
{"$rows_left_out":17}
{"sheet":"Harrow Spell (U-fill)","index":4,"n_rows":22,"n_cols":17,"rows_kept":22,"cut":false,"hidden":false,"merged":[[21,11,21,12],[21,15,21,16],[15,1,15,3],[15,7,15,8],[15,11,15,12],[15,15,15,16],[17,5,20,5],[18,6,18,8],[18,10,18,12],[18,14,18,16],[19,6,19,8],[19,10,19,12],[16,1,21,3],[19,14,19,16],[20,6,20,8],[20,10,20,12],[20,14,20,16],[21,7,21,8],[14,14,14,16],[9,1,9,3],[9,7,9,8],[9,11,9,12],[9,15,9,16],[10,1,10,3],[11,1,11,2],[11,5,14,5],[12,1,12,3],[12,6,12,8],[12,10,12,12],[12,14,12,16],[13,1,13,3],[13,6,13,8],[13,10,13,12],[13,14,13,16],[4,1,4,3],[6,1,8,3],[14,1,14,3],[14,6,14,8],[14,10,14,12],[7,6,8,8],[7,10,8,12],[7,14,8,16],[0,1,0,3],[0,6,0,8],[0,10,0,12],[0,14,0,16],[1,1,1,3],[1,5,8,5],[2,6,2,8],[2,10,2,12],[2,14,2,16],[3,1,3,3],[3,6,6,8],[3,10,6,12],[3,14,6,16]]}
[null,"Alignment",null,null,null,null,"Past",null,null,null,"Present",null,null,null,"Future"]
[null,null,null,null,null,"Positive",{"$f":"IFERROR(LEFT(VLOOKUP(G3,Cards!$B$2:$G$55,3,FALSE),3),\"\")","v":""},null,{"$f":"IFERROR(VLOOKUP(G3,Cards,4,FALSE),\"\")","v":""},null,{"$f":"IFERROR(LEFT(VLOOKUP(K3,Cards!$B$2:$G$55,3,FALSE),3),\"\")","v":""},null,{"$f":"IFERROR(VLOOKUP(K3,Cards,4,FALSE),\"\")","v":""},null,{"$f":"IFERROR(LEFT(VLOOKUP(O3,Cards!$B$2:$G$55,3,FALSE),3),\"\")","v":""},null,{"$f":"IFERROR(VLOOKUP(O3,Cards,4,FALSE),\"\")","v":""}]
[null,null,{"$f":"IF(B2=\"N\",\"<-- Choose one of CE,LE,CG,LG\",\"\")","v":""}]
[null,{"$f":"IF(alignment=\"\",\"\",IF(alignment=\"N\",IF(LEN(override)=2,override,\"\"),IF(LEFT(alignment,1)=\"L\",\"C\",IF(LEFT(alignment,1)=\"C\",\"L\",\"N\"))&IF(RIGHT(alignment,1)=\"G\",\"E\",IF(RIGHT(alignment,1)=\"E\",\"G\",\"N\"))))","v":""},null,null,null,null,{"$f":"IFERROR(VLOOKUP(G3,Cards,5,FALSE),\"\")","v":""},null,null,null,{"$f":"IFERROR(VLOOKUP(K3,Cards,5,FALSE),\"\")","v":""},null,null,null,{"$f":"IFERROR(VLOOKUP(O3,Cards,5,FALSE),\"\")","v":""}]
[null,"Opposite"]
[]
{"$rows_left_out":17}
{"sheet":"Bridge (autodraw)","index":5,"n_rows":23,"n_cols":22,"rows_kept":23,"cut":false,"hidden":false,"merged":[[6,15,6,16],[6,11,6,12],[1,6,4,11],[22,18,23,20],[14,21,23,21],[10,6,15,8],[16,6,17,8],[10,14,15,16],[2,21,11,21],[10,18,11,20],[4,18,9,20],[2,18,3,20],[16,14,17,16],[16,18,21,20],[14,18,15,20],[8,14,9,16],[8,6,9,8],[8,10,9,12],[14,1,23,1],[2,1,11,1],[16,2,21,4],[14,2,15,4],[4,2,9,4],[10,2,11,4],[22,2,23,4],[2,2,3,4],[16,10,17,12],[6,7,6,8],[10,10,15,12]]}
[]
[null,2,{"$f":"IF(RANDBETWEEN(0,1)=1,\"X\",\"\")","v":""},"Reversed",{"$f":"IFERROR(VLOOKUP(C3,Cards,4,FALSE),\"\")","v":"CG"},null,"Instructions\n\nPress F9 to deal cards into the Bridge. Cards that are reversed are indicated with an X in the \"Reversed\" box (upper left). These cards are considered misaligned. If a card has a misaligned meaning, it is printed in the lower box.",null,null,null,null,null,null,null,null,null,null,null,{"$f":"IF(RANDBETWEEN(0,1)=1,\"X\",\"\")","v":""},"Reversed",{"$f":"IFERROR(VLOOKUP(S3,Cards,4,FALSE),\"\")","v":"LG"},7]
[null,"Impetus",{"$f":"VLOOKUP(B2,Draw!$I$2:$K$10,3,FALSE)","v":"Joke"},null,null,null,null,null,null,null,null,null,null,null,null,null,null,null,{"$f":"VLOOKUP(V2,Draw!$I$2:$K$10,3,FALSE)","v":"Trumpet"},null,null,"The Sacrifice"]
[]
[null,null,{"$f":"IFERROR(VLOOKUP(C3,Cards,5,FALSE),\"\")","v":"shows a terror that must be overcome—but not by physical means. This monster can only be defeated by trickery or artifice. This card can represent the value of humor in finding the way past a difficult person or task."},null,null,null,null,null,null,null,null,null,null,null,null,null,null,null,{"$f":"IFERROR(VLOOKUP(S3,Cards,5,FALSE),\"\")","v":"is a declaration of power. This archon is an aggressive force who wades into the direst situations without hesitation in the cause of right. It is a card that grants all or nothing at all."}]
[]
{"$rows_left_out":18}
{"sheet":"Bridge (U-fill)","index":6,"n_rows":23,"n_cols":22,"rows_kept":23,"cut":false,"hidden":false,"merged":[[14,21,23,21],[16,18,21,20],[22,18,23,20],[2,21,11,21],[8,10,9,12],[2,18,3,20],[4,18,9,20],[6,11,6,12],[6,15,6,16],[10,14,15,16],[10,10,15,12],[16,10,17,12],[14,18,15,20],[10,18,11,20],[8,14,9,16],[16,14,17,16],[14,1,23,1],[22,2,23,4],[4,2,9,4],[2,1,11,1],[8,6,9,8],[6,7,6,8],[2,2,3,4],[1,6,4,13],[10,2,11,4],[14,2,15,4],[16,2,21,4],[10,6,15,8],[16,6,17,8]]}
[]
[null,2,null,"Reversed",{"$f":"IFERROR(VLOOKUP(C3,Cards,4,FALSE),\"\")","v":""},null,"Instructions\n\nChoose a card for each position in the Bridge using the grey drop-down box. Then indicate whether or not that card is reversed (potentially misaligned) by placing an X in the \"Reversed\" box in the upper left. If a card has a misaligned placement, the misaligned meaning is printed in the lower box. The spreadsheet does not detect if the same card is entered more than once.",null,null,null,null,null,null,null,null,null,null,null,null,"Reversed",{"$f":"IFERROR(VLOOKUP(S3,Cards,4,FALSE),\"\")","v":""},7]
[null,"Impetus",null,null,null,null,null,null,null,null,null,null,null,null,null,null,null,null,null,null,null,"The Sacrifice"]
[]
[null,null,{"$f":"IFERROR(VLOOKUP(C3,Cards,5,FALSE),\"\")","v":""},null,null,null,null,null,null,null,null,null,null,null,null,null,null,null,{"$f":"IFERROR(VLOOKUP(S3,Cards,5,FALSE),\"\")","v":""}]
[]
{"$rows_left_out":18}
{"sheet":"Cross (autodraw)","index":7,"n_rows":17,"n_cols":14,"rows_kept":17,"cut":false,"hidden":false,"merged":[[16,2,16,4],[15,2,15,4],[10,2,10,4],[9,2,9,4],[8,1,10,1],[12,1,15,1],[13,2,13,4],[14,2,14,4],[8,2,8,4],[1,13,4,13],[2,10,2,12],[9,6,9,8],[9,10,9,12],[10,10,10,12],[8,10,8,12],[8,13,10,13],[2,6,2,8],[3,6,3,8],[6,6,6,8],[7,6,7,7],[8,6,8,8],[10,6,10,8],[14,6,14,8],[15,6,15,8],[16,7,16,8],[13,6,13,8],[12,13,15,13],[13,10,13,12],[14,10,14,12],[15,10,15,12],[16,10,16,12],[0,2,0,4],[0,7,0,8],[0,10,0,12],[1,1,4,4],[4,6,4,8],[3,10,3,12],[4,10,4,12]]}
[null,null,null,null,null,null,4,"Destination"]
[null,"Instructions\n\nChoose the character's alignment and primary stat in the \"Signifier\" box. The spreadsheet will place the Signifier card in this position, and then draw the remaining cards. Press F9 to deal a new spread\n\nNone of the cards in the Cross spread are misaligned.",null,null,null,null,{"$f":"IFERROR(LEFT(VLOOKUP(G3,Cards,3,FALSE),3),\"\")","v":""},null,{"$f":"IFERROR(VLOOKUP(G3,Cards,4,FALSE),\"\")","v":""}]
[null,null,null,null,null,null,{"$f":"IF(LEN($G$9)>0,Draw!S6,\"\")","v":""}]
[null,null,null,null,null,null,{"$f":"IFERROR(VLOOKUP(G3,Cards,5,FALSE),\"\")","v":""}]
[]
[]
{"$rows_left_out":12}
{"sheet":"Cross (U-fill)","index":8,"n_rows":17,"n_cols":14,"rows_kept":17,"cut":false,"hidden":false,"merged":[[16,2,16,4],[16,10,16,12],[16,7,16,8],[8,1,10,1],[15,10,15,12],[14,6,14,8],[15,6,15,8],[14,10,14,12],[13,10,13,12],[9,6,9,8],[8,6,8,8],[10,10,10,12],[9,10,9,12],[15,2,15,4],[12,1,15,1],[14,2,14,4],[0,10,0,12],[8,13,10,13],[0,7,0,8],[8,2,8,4],[9,2,9,4],[1,1,4,4],[0,2,0,4],[3,6,3,8],[2,6,2,8],[4,6,4,8],[6,6,6,8],[7,6,7,7],[8,10,8,12],[12,13,15,13],[1,13,4,13],[10,2,10,4],[10,6,10,8],[2,10,2,12],[3,10,3,12],[4,10,4,12],[13,2,13,4],[13,6,13,8]]}
[null,null,null,null,null,null,4,"Destination"]
[null,"Instructions\n\nChoose the character's alignment and primary stat in the \"Signifier\" box. The spreadsheet will automatically place the corresponding Signifier card in this position.\n\nThen, place the remainder of the cards in the spread using the grey drop-down boxes. None of the cards in the Cross spread are misaligned.\n\nNote that spreadsheet does not try to detect if the same card is entered in multiple positions.",null,null,null,null,{"$f":"IFERROR(LEFT(VLOOKUP(G3,Cards,3,FALSE),3),\"\")","v":""},null,{"$f":"IFERROR(VLOOKUP(G3,Cards,4,FALSE),\"\")","v":""}]
[]
[null,null,null,null,null,null,{"$f":"IFERROR(VLOOKUP(G3,Cards,5,FALSE),\"\")","v":""}]
[]
[]
{"$rows_left_out":12}
{"sheet":"Sword (autodraw)","index":9,"n_rows":51,"n_cols":12,"rows_kept":51,"cut":false,"hidden":false,"merged":[[3,5,4,7],[1,6,1,7],[1,1,5,3],[9,1,10,3],[7,2,7,3],[7,10,7,11],[9,9,10,11],[5,5,10,7],[11,5,12,7],[14,6,14,7],[11,9,16,11],[17,9,18,11],[17,1,18,3],[11,1,16,3],[40,6,40,7],[37,5,38,7],[31,5,36,7],[29,5,30,7],[16,5,17,7],[18,5,23,7],[50,5,51,7],[44,5,49,7],[42,5,43,7],[27,6,27,7],[24,5,25,7]]}
[]
[null,"Instructions\n\nPress F9 to deal cards into the Sword. Cards that are reversed are indicated with an X in the \"Reversed\" box (upper left) and are misaligned. If a card has a misaligned meaning, it is printed in the lower box.",null,null,null,6,"Outcome"]
[null,null,null,null,null,{"$f":"IF(RANDBETWEEN(0,1)=1,\"X\",\"\")","v":"X"},"Reversed",{"$f":"IFERROR(VLOOKUP(F4,Cards,4,FALSE),\"\")","v":"NE"}]
[null,null,null,null,null,{"$f":"VLOOKUP(F2,Draw!$I$2:$K$10,3,FALSE)","v":"Mute Hag"}]
[]
[null,null,null,null,null,{"$f":"IFERROR(VLOOKUP(F4,Cards,5,FALSE),\"\")","v":"might be silent, but the eye she holds lets her see into the hearts of men. This hag invokes blood pacts and poisonous secrets, the kind that turn brother against brother and son against father. It is a card that performers loathe, as it leaves them stumbling over their words and songs."}]
{"$rows_left_out":46}
{"sheet":"Sword (U-fill)","index":10,"n_rows":51,"n_cols":12,"rows_kept":51,"cut":false,"hidden":false,"merged":[[17,1,18,3],[5,5,10,7],[16,5,17,7],[9,9,10,11],[11,9,16,11],[17,9,18,11],[11,5,12,7],[14,6,14,7],[7,10,7,11],[7,2,7,3],[1,1,5,3],[9,1,10,3],[11,1,16,3],[3,5,4,7],[1,6,1,7],[29,5,30,7],[27,6,27,7],[18,5,23,7],[24,5,25,7],[31,5,36,7],[40,6,40,7],[44,5,49,7],[50,5,51,7],[42,5,43,7],[37,5,38,7]]}
[]
[null,"Instructions\n\nChoose a card for each position in the Sword using the drop-down box then indicate whether or not that card is reversed by placing an X in the \"Reversed\" box in the upper left. If a card has a misaligned placement, the misaligned meaning is printed in the lower box.",null,null,null,6,"Outcome"]
[null,null,null,null,null,null,"Reversed",{"$f":"IFERROR(VLOOKUP(F4,Cards,4,FALSE),\"\")","v":""}]
[]
[]
[null,null,null,null,null,{"$f":"IFERROR(VLOOKUP(F4,Cards,5,FALSE),\"\")","v":""}]
{"$rows_left_out":46}
{"sheet":"Path (autodraw)","index":11,"n_rows":52,"n_cols":24,"rows_kept":52,"cut":false,"hidden":false,"merged":[[1,17,1,18],[29,8,29,11],[26,16,27,20],[26,10,27,14],[29,14,29,17],[20,16,25,20],[20,10,25,14],[3,8,3,11],[1,1,1,16],[3,2,3,5],[3,20,3,23],[17,3,27,3],[3,14,3,17],[26,4,27,8],[7,13,12,17],[7,19,12,23],[16,17,16,20],[16,11,16,14],[18,16,19,20],[4,0,14,0],[13,1,14,5],[7,1,12,5],[5,1,6,5],[5,19,6,23],[13,19,14,23],[5,7,6,11],[13,13,14,17],[5,13,6,17],[20,4,25,8],[18,4,19,8],[16,5,16,8],[7,7,12,11],[13,7,14,11],[18,10,19,14],[51,10,52,14],[30,6,40,6],[42,9,52,9],[43,10,44,14],[39,7,40,11],[33,13,38,17],[33,7,38,11],[39,13,40,17],[31,13,32,17],[45,10,50,14],[31,7,32,11]]}
[]
[null,"Instructions. Click the deal button to deal the cards (you MUST click the deal button; unlike the other sheets, this one cannot rely on auto-recalculation) and then select the desired path by putting an X's in the \"Choose\" boxes. Chosen cards are revealed, and misaligned (reversed) cards have their meaning printed in the lower box. Macros must be enabled for this sheet to function."]
[]
[7,null,"Choose",null,null,null,8,null,"Choose",null,null,null,9,null,"Choose",null,null,null,10,null,"Choose"]
["Future",{"$f":"IFERROR(IF(ISBLANK(B4),\"\",IF(VLOOKUP(A4,DrawPath,2,FALSE)=1,\"X\",\"\")),\"\")","v":""},"Reversed",null,null,{"$f":"IFERROR(IF(ISBLANK(B4),\"\",VLOOKUP(B6,Cards,4,FALSE)),\"\")","v":""},null,{"$f":"IFERROR(IF(ISBLANK(H4),\"\",IF(VLOOKUP(G4,DrawPath,2,FALSE)=1,\"X\",\"\")),\"\")","v":""},"Reversed",null,null,{"$f":"IFERROR(IF(ISBLANK(H4),\"\",VLOOKUP(H6,Cards,4,FALSE)),\"\")","v":""},null,{"$f":"IFERROR(IF(ISBLANK(N4),\"\",IF(VLOOKUP(M4,DrawPath,2,FALSE)=1,\"X\",\"\")),\"\")","v":""},"Reversed",null,null,{"$f":"IFERROR(IF(ISBLANK(N4),\"\",VLOOKUP(N6,Cards,4,FALSE)),\"\")","v":""},null,{"$f":"IFERROR(IF(ISBLANK(T4),\"\",IF(VLOOKUP(S4,DrawPath,2,FALSE)=1,\"X\",\"\")),\"\")","v":""},"Reversed",null,null,{"$f":"IFERROR(IF(ISBLANK(T4),\"\",VLOOKUP(T6,Cards,4,FALSE)),\"\")","v":""}]
[null,{"$f":"IFERROR(IF(ISBLANK(B4),\"\",VLOOKUP(A4,DrawPath,3,FALSE)),\"\")","v":""},null,null,null,null,null,{"$f":"IFERROR(IF(ISBLANK(H4),\"\",VLOOKUP(G4,DrawPath,3,FALSE)),\"\")","v":""},null,null,null,null,null,{"$f":"IFERROR(IF(ISBLANK(N4),\"\",VLOOKUP(M4,DrawPath,3,FALSE)),\"\")","v":""},null,null,null,null,null,{"$f":"IFERROR(IF(ISBLANK(T4),\"\",VLOOKUP(S4,DrawPath,3,FALSE)),\"\")","v":""}]
{"$rows_left_out":47}
{"sheet":"Cards","index":12,"n_rows":55,"n_cols":7,"rows_kept":55,"cut":false,"hidden":true,"merged":[]}
["AbilityIndex","Name","Suit","Ability","Alignment","Description","Misaligned"]
[{"$f":"D2&E2","v":"DexterityLE"},"Avalanche","Keys","Dexterity","LE","is disaster. It is an unthinking, unreasoning thing that overruns all who get in its way. It can represent physical disaster or the disaster that comes from a panicked crowd or other unthinking group or entity. ","Misaligned, the calamity is likely to be averted, though not without consequence."]
["StrengthN","Bear","Hammers","Strength","N","is pure strength. People often make the mistake of thinking The Bear can be tamed or trained. When someone believes he has The Bear under control, that person eventually learns the error of his ways. Brute force might be required here, but the consequences of its use might be severe."]
["StrengthNE","Beating","Hammers","Strength","NE","signifies coming under attack from all sides, but it can also indicate the dissolution of the self—mentally. Whether the strength is of the flesh or the mind, it dissolves under the relentless attack. ","Misaligned, this card suggests that during the assault, undiscovered strength is found."]
["CharismaNE","Betrayal","Crowns","Charisma","NE","is selfishness incarnate. Envy twists the spirit and leads ultimately to devastation. It can also indicate a person whose loveliness hides an evil heart. ","Misaligned, the card means self-sacrifice or turning away from the material world and its temptations."]
["StrengthCG","Big Sky","Hammers","Strength","CG","shows an epic moment as the slaves of a nation are freed. The slaves’ freedom specifies momentous and powerful change, as old shackles are cast off in the light of day. ","Misaligned, those castoff shackles might be replaced with worse ones."]
{"$rows_left_out":50}
{"sheet":"Data","index":13,"n_rows":10,"n_cols":4,"rows_kept":10,"cut":false,"hidden":true,"merged":[]}
["Alignments","Abilities","Abbrev","Check"]
["LG","Strength",{"$f":"LEFT(B2,3)","v":"Str"},"Attack roll"]
["NG","Dexterity",{"$f":"LEFT(B3,3)","v":"Dex"},"Refl save"]
["CG","Constitution","Con","Fort save"]
["LN","Intelligence","Int","Skill check"]
["N","Wisdom","Wis","Will save"]
{"$rows_left_out":5}
{"sheet":"Draw","index":14,"n_rows":55,"n_cols":31,"rows_kept":55,"cut":false,"hidden":true,"merged":[]}
["Shuffle","Card",null,"Attr","Index","Lookup","Card",null,"Draw","Rank","Card",null,"Seed",null,"Adj Rank","Card","Draw","Rank","Card",null,"Draw Path","Reversed","Card","RevAutoSrc",null,"Attribute (Spell)","N","Valid Cards","Attribute (Tapestry)","N","Valid Cards"]
[{"$f":"RAND()","v":0.34213891603132696},{"$f":"Cards!B2","v":"Avalanche"},null,"Charisma",{"$f":"MOD((ROW()-2),9)+1","v":1},{"$f":"D2&\"-\"&E2","v":"Charisma-1"},"Betrayal",null,1,{"$f":"LARGE(A2:A55,I2)","v":0.98491571079199247},{"$f":"VLOOKUP(J2,A2:B55,2,FALSE)","v":"Bear"},null,0.58961182034533133,null,{"$f":"A2+IF(P2='Cross (autodraw)'!$G$9,1,0)","v":0.34213891603132696},{"$f":"B2","v":"Avalanche"},1,{"$f":"LARGE(O2:O55,ROW()-1)","v":0.98491571079199247},{"$f":"VLOOKUP(R2,O2:P55,2,FALSE)","v":"Bear"},null,1,1,"Mute Hag",{"$f":"RANDBETWEEN(0,1)","v":0},null,{"$f":"'Harrow Spell (U-fill)'!B12","v":0},1,{"$f":"IFERROR(VLOOKUP($Z$2&\"-\"&AA2,cardattrindex,2,FALSE),\"\")","v":""},{"$f":"'Tapestry (U-fill)'!B7","v":0},1,{"$f":"IFERROR(VLOOKUP($AC$2&\"-\"&AD2,cardattrindex,2,FALSE),\"\")","v":""}]
[0.98491571079199247,{"$f":"Cards!B3","v":"Bear"},null,"Charisma",2,"Charisma-2","Courtesan",null,2,0.97819907091516445,"Joke",null,null,null,{"$f":"A3+IF(P3='Cross (autodraw)'!$G$9,1,0)","v":0.98491571079199247},"Bear",2,0.97819907091516445,"Joke",null,2,1,"Lost",1,null,null,2,{"$f":"IFERROR(VLOOKUP($Z$2&\"-\"&AA3,cardattrindex,2,FALSE),\"\")","v":""},null,2,{"$f":"IFERROR(VLOOKUP($AC$2&\"-\"&AD3,cardattrindex,2,FALSE),\"\")","v":""}]
[3.1464596709415149E-3,{"$f":"Cards!B4","v":"Beating"},null,"Charisma",3,"Charisma-3","Empty Throne",null,3,0.85494908661799207,"Desert",null,null,null,{"$f":"A4+IF(P4='Cross (autodraw)'!$G$9,1,0)","v":3.1464596709415149E-3},"Beating",3,0.85494908661799207,"Desert",null,3,0,"Snakebite",0,null,null,3,{"$f":"IFERROR(VLOOKUP($Z$2&\"-\"&AA4,cardattrindex,2,FALSE),\"\")","v":""},null,3,{"$f":"IFERROR(VLOOKUP($AC$2&\"-\"&AD4,cardattrindex,2,FALSE),\"\")","v":""}]
[0.82502577333457294,{"$f":"Cards!B5","v":"Betrayal"},null,"Charisma",4,"Charisma-4","Liar",null,4,0.82502577333457294,"Betrayal",null,null,null,{"$f":"A5+IF(P5='Cross (autodraw)'!$G$9,1,0)","v":0.82502577333457294},"Betrayal",4,0.82502577333457294,"Betrayal",null,4,1,"Desert",1,null,null,4,{"$f":"IFERROR(VLOOKUP($Z$2&\"-\"&AA5,cardattrindex,2,FALSE),\"\")","v":""},null,4,{"$f":"IFERROR(VLOOKUP($AC$2&\"-\"&AD5,cardattrindex,2,FALSE),\"\")","v":""}]
[0.17146462736284418,{"$f":"Cards!B6","v":"Big Sky"},null,"Charisma",5,"Charisma-5","Marriage",null,5,0.78370794869608074,"Eclipse",null,null,null,{"$f":"A6+IF(P6='Cross (autodraw)'!$G$9,1,0)","v":0.17146462736284418},"Big Sky",5,0.78370794869608074,"Eclipse",null,5,1,"Eclipse",1,null,null,5,{"$f":"IFERROR(VLOOKUP($Z$2&\"-\"&AA6,cardattrindex,2,FALSE),\"\")","v":""},null,5,{"$f":"IFERROR(VLOOKUP($AC$2&\"-\"&AD6,cardattrindex,2,FALSE),\"\")","v":""}]
{"$rows_left_out":49}